Identifier Type
type: Property
comment: Formal name or acronym of the identifier type such as ISBN and ISSN.
term status: stable
change history: https://credreg.net/ctdl/termhistory/ceterms/identifierType/json
domain includes: IdentifierValue
range includes: langString