Identifier Type
type: Property
comment: Framework, scheme, type, or other organizing principle of this identifier.
term status: stable
change history: https://credreg.net/ctdl/termhistory/ceterms/identifierType/json
domain includes: IdentifierValue
range includes: anyURI