Identifier Type Name
type: Property
comment: Formal name or acronym of the framework, scheme, type, or other organizing principle of this identifier, such as ISBN or ISSN.
term status: stable
change history: https://credreg.net/ctdl/termhistory/ceterms/identifierTypeName/json
domain includes: IdentifierValue
range includes: langString