Identifier Value Code
type: Property
comment: Alphanumeric string identifier of the entity.
description: Where a formal identification system exists for the identifier, recommended best practice is to use a string conforming to that system.
term status: stable
change history: https://credreg.net/ctdl/termhistory/ceterms/identifierValueCode/json
domain includes: IdentifierValue
range includes: string