In Demand Action
type: Property
comment: Assertion by an agent that this resource has a specific workforce demand level.
term status: unstable
change history: https://credreg.net/ctdl/termhistory/ceterms/inDemandAction/json
sub property of: relatedAction
domain includes: CredentialOrganization
domain includes: Organization
domain includes: QACredentialOrganization
range includes: WorkforceDemandAction