Is Non-Credit
type: Property
comment: Resource carries or confers no official academic credit according to the provider of the resource.
term status: unstable
change history: https://credreg.net/ctdl/termhistory/ceterms/isNonCredit/json
domain includes: AcademicCertificate
domain includes: ApprenticeshipCertificate
domain includes: AssessmentProfile
domain includes: Badge
domain includes: BasicTechnicalCertificate
domain includes: Certificate
domain includes: CertificateOfCompletion
domain includes: CertificateOfParticipation
domain includes: Certification
domain includes: Course
domain includes: DigitalBadge
domain includes: Diploma
domain includes: JourneymanCertificate
domain includes: LearningOpportunityProfile
domain includes: LearningProgram
domain includes: License
domain includes: MasterCertificate
domain includes: MicroCredential
domain includes: OpenBadge
domain includes: PreApprenticeshipCertificate
domain includes: ProfessionalCertificate
domain includes: ProficiencyCertificate
domain includes: SecondaryEducationCertificate
domain includes: WorkBasedLearningCertificate
range includes: boolean