Is Proctored
type: Property
comment: Whether or not the assessment is supervised or monitored by an agent.
description: Such supervision or proctoring includes: (1) guaranteeing of the identities of the examinees; (2) the conditions of the examination including instructions, time, materials, equipment and completion, and (3) completed without unauthorized assistance.
term status: stable
change history: https://credreg.net/ctdl/termhistory/ceterms/isProctored/json
domain includes: AssessmentProfile
range includes: boolean