Is Registered Apprenticeship
type: Property
comment: The resource is registered with a governmental agency or other authorized organization because it has been vetted, approved and validated to meet specific criteria.
term status: unstable
change history: https://credreg.net/ctdl/termhistory/ceterms/isRegisteredApprenticeship/json
domain includes: ApprenticeshipCertificate
domain includes: Course
domain includes: JourneymanCertificate
domain includes: LearningOpportunityProfile
domain includes: LearningProgram
domain includes: MasterCertificate
domain includes: PreApprenticeshipCertificate
domain includes: WorkBasedLearningCertificate
range includes: boolean