Is Similar To
type: Property
comment: Another functionally similar entity.
description: The property is generally applicable in describing the similarity between any two entities.
term status: stable
change history: https://credreg.net/ctdl/termhistory/ceterms/isSimilarTo/json
range includes: anyURI
equivalent property: isSimilarTo
equivalent property: related