Is Specialization Of
type: Property
comment: Less specialized profession, trade, career field or industry that encompasses the one being described.
term status: stable
change history: https://credreg.net/ctdl/termhistory/ceterms/isSpecializationOf/json
domain includes: Industry
domain includes: Occupation
range includes: Industry
range includes: Occupation