Jobs Obtained
type: Property
comment: Number of jobs obtained in the region during a given timeframe.
term status: stable
change history: https://credreg.net/ctdl/termhistory/ceterms/jobsObtained/json
domain includes: AggregateDataProfile
domain includes: EmploymentOutcomeProfile
range includes: QuantitativeValue