Jurisdiction Exception
type: Property
comment: Geographic or political region in which the credential is not formally recognized or an organization has no authority to act .
description: The ceterms:jurisdictionalException property is used in conjunction with the ceterms:jurisdiction property and expresses any exceptions to a more general statement; e.g., the United states except for Colorado.
term status: stable
change history: https://credreg.net/ctdl/termhistory/ceterms/jurisdictionException/json
sub property of: spatialCoverage
domain includes: JurisdictionProfile
range includes: Place