Keyword
type: Property
comment: Keyword or key phrase describing relevant aspects of an entity.
usage note: Use the keyword property to enter free text keywords. A subject concept in a controlled vocabulary should use the subject property.
term status: stable
change history: https://credreg.net/ctdl/termhistory/ceterms/keyword/json
sub property of: about
domain includes: ApprenticeshipCertificate
domain includes: AssessmentProfile
domain includes: AssociateDegree
domain includes: BachelorDegree
domain includes: Badge
domain includes: Certificate
domain includes: CertificateOfCompletion
domain includes: Certification
domain includes: Credential
domain includes: CredentialOrganization
domain includes: CredentialPerson
domain includes: Degree
domain includes: DigitalBadge
domain includes: Diploma
domain includes: DoctoralDegree
domain includes: GeneralEducationDevelopment
domain includes: Job
domain includes: JourneymanCertificate
domain includes: LearningOpportunityProfile
domain includes: License
domain includes: MasterCertificate
domain includes: MasterDegree
domain includes: MicroCredential
domain includes: Occupation
domain includes: OpenBadge
domain includes: Pathway
domain includes: ProfessionalDoctorate
domain includes: QACredentialOrganization
domain includes: QualityAssuranceCredential
domain includes: ResearchDoctorate
domain includes: SecondarySchoolDiploma
range includes: langString
equivalent property: conceptKeyword