Learning Opportunity Profiled
type: Property
comment: The cost profile being described is a profile of the learning opportunity being referenced.
term status: deprecated
change history: https://credreg.net/ctdl/termhistory/ceterms/learningOpportunityProfiled/json
range includes: LearningOpportunityProfile