Learning Recognition Outcome Type
type: Property
comment: Type of outcome governed or permitted by the policy; select from an existing enumeration of such types.
term status: unstable
change history: https://credreg.net/ctdl/termhistory/ceterms/learningRecognitionOutcomeType/json
domain includes: PriorLearningPolicy
domain includes: TransferAgreement
range includes: Concept
target scheme: LearningRecognitionOutcomeCategory