Learning Recognition Source Type
type: Property
comment: Type of context from which prior learning may be recognized; select from an existing enumeration of such types.
term status: unstable
change history: https://credreg.net/ctdl/termhistory/ceterms/learningRecognitionSourceType/json
domain includes: PriorLearningPolicy
domain includes: TransferAgreement
range includes: Concept
target scheme: LearningRecognitionSourceCategory