Learning Resource
type: Property
comment: Learning resource used to support an activity in a learning opportunity.
description: Examples include a textbook, workbook, lesson plan that describes or records the learning activity and its objectives (e.g. an audio- or video-recording of a lesson).
term status: deprecated
superseded by: targetLearningResource
change history: https://credreg.net/ctdl/termhistory/ceterms/learningResource/json
range includes: LearningResource