Main Jurisdiction
type: Property
comment: Primary geographic or political region in which the credential is recognized as applicable or in which an organization has recognized authority to act.
term status: stable
change history: https://credreg.net/ctdl/termhistory/ceterms/mainJurisdiction/json
sub property of: spatialCoverage
domain includes: JurisdictionProfile
range includes: Place