Maximum Duration
type: Property
comment: Maximum amount of time it will take to complete the activity.
description: The value of ceterms:maximumDuration denotes an approximation of duration.
usage note: Do not use ceterms:maximumDuration to identify the renewal frequency of a credential; use ceterms:renewalFrequency instead.
term status: stable
change history: https://credreg.net/ctdl/termhistory/ceterms/maximumDuration/json
domain includes: DurationProfile
range includes: duration