Membership Condition
type: Property
comment: Conditions and requirements to be included as a member.
term status: unstable
change history: https://credreg.net/ctdl/termhistory/ceterms/membershipCondition/json
domain includes: Collection
range includes: ConditionProfile