Minimum Duration
type: Property
comment: Minimum amount of time it will take to complete the activity.
description: The value of ceterms:minimumDuration denotes an approximation of duration.
term status: stable
change history: https://credreg.net/ctdl/termhistory/ceterms/minimumDuration/json
domain includes: DurationProfile
range includes: Duration