OPE ID
type: Property
comment: OPE ID number (U.S. Office of Postsecondary Education Identification), sometimes referred to as the Federal School Code.
description: Identification number used by the U.S. Department of Education's Office of Postsecondary Education (OPE) to identify schools that have Program Participation Agreements (PPA) so that its students are eligible to participate in Federal Student Financial Assistance (FAFSA) programs under Title IV regulations. This is a 6-digit number followed by a 2-digit suffix used to identify branches, additional locations, and other entities that are part of the eligible institution.
term status: stable
change history: https://credreg.net/ctdl/termhistory/ceterms/opeID/json
domain includes: CredentialOrganization
domain includes: Organization
domain includes: QACredentialOrganization
range includes: string