Parent Organization
type: Property
comment: Larger organization exercising authority over the organization being described.
term status: stable
change history: https://credreg.net/ctdl/termhistory/ceterms/parentOrganization/json
domain includes: CredentialOrganization
domain includes: QACredentialOrganization
range includes: CredentialOrganization
range includes: QACredentialOrganization
equivalent property: parentOrganization