Part of Identifier Value Set
type: Property
comment: Set of logically related identifiers to which this identifer belongs.
usage note: While a literal naming the Identifier Value Set is acceptable in the absence of the URL of an identifier system, best practice is to identify the Identifier Value Set by URL
term status: deprecated
change history: https://credreg.net/ctdl/termhistory/ceterms/partOfIdentifierValueSet/json
range includes: IdentifierValueSet