Pay Band Type
type: Property
comment: Type of pay band indicating a range or classification of monetary compensation associated with work; select from an existing enumeration of such types.
term status: unstable
change history: https://credreg.net/ctdl/termhistory/ceterms/payBandType/json
domain includes: PayProfile
range includes: Concept