Post Office Box Number
type: Property
comment: Post office box number for post office addresses.
term status: stable
change history: https://credreg.net/ctdl/termhistory/ceterms/postOfficeBoxNumber/json
domain includes: Place
domain includes: PostalAddress
range includes: string
equivalent property: postOfficeBoxNumber