Post Receipt Months
type: Property
comment: Number of months after earning a credential when employment and earnings data is collected.
description: Number of months usually range between 3 months (one quarter) to ten years.
term status: stable
change history: https://credreg.net/ctdl/termhistory/ceterms/postReceiptMonths/json
domain includes: AggregateDataProfile
domain includes: EarningsProfile
range includes: integer