Precedes
type: Property
comment: Resource that logically comes after this resource.
description: The ceterms:precedes property indicates a simple or suggested ordering of resources.
term status: stable
change history: https://credreg.net/ctdl/termhistory/ceterms/precedes/json
domain includes: ProgressionLevel
domain includes: AssessmentComponent
domain includes: BasicComponent
domain includes: CocurricularComponent
domain includes: CollectionComponent
domain includes: CompetencyComponent
domain includes: CourseComponent
domain includes: CredentialComponent
domain includes: ExtracurricularComponent
domain includes: JobComponent
domain includes: MultiComponent
domain includes: WorkExperienceComponent
domain includes: Concept
range includes: ProgressionLevel
range includes: AssessmentComponent
range includes: BasicComponent
range includes: CocurricularComponent
range includes: CollectionComponent
range includes: CompetencyComponent
range includes: CourseComponent
range includes: CredentialComponent
range includes: ExtracurricularComponent
range includes: JobComponent
range includes: MultiComponent
range includes: WorkExperienceComponent
range includes: Concept
inverse of: precededBy