Process Method Type
type: Property
comment: Type of method used to confirm or validate the need for, and relative importance of, competencies and learning outcomes; select from an existing enumeration of such types..
usage note: Best practice for U.S. credentials and for submission to the Credential Engine Registry, is to use concepts from the cetermsProcessMethod vocabulary.
term status: deprecated
change history: https://credreg.net/ctdl/termhistory/ceterms/processMethodType/json
sub property of: credentialAlignment
range includes: CredentialAlignmentObject