Processing Agent
type: Property
comment: Organization or person performing the process.
term status: stable
change history: https://credreg.net/ctdl/termhistory/ceterms/processingAgent/json
domain includes: ProcessProfile
range includes: CredentialOrganization
range includes: CredentialPerson
range includes: QACredentialOrganization