Regulation Type
type: Property
comment: Indicates the regulation or other legal requirement for which this data is provided.
description: The value of this property will normally be a URI for a Concept that identifies the regulation.
term status: unstable
change history: https://credreg.net/ctdl/termhistory/ceterms/regulationType/json
domain includes: RegulatoryInformation
range includes: Concept