Regulatory Information For
type: Property
comment: Resource that this regulatory information is about.
term status: unstable
change history: https://credreg.net/ctdl/termhistory/ceterms/regulatoryInformationFor/json
domain includes: RegulatoryInformation
range includes: AcademicCertificate
range includes: AccreditAction
range includes: AdvancedStandingAction
range includes: ApprenticeshipCertificate
range includes: ApproveAction
range includes: Assessment
range includes: AssociateDegree
range includes: AssociateOfAppliedArtsDegree
range includes: AssociateOfAppliedScienceDegree
range includes: AssociateOfArtsDegree
range includes: AssociateOfScienceDegree
range includes: BachelorDegree
range includes: BachelorOfArtsDegree
range includes: BachelorOfScienceDegree
range includes: Badge
range includes: BasicTechnicalCertificate
range includes: Certificate
range includes: CertificateOfCompletion
range includes: CertificateOfParticipation
range includes: Certification
range includes: Collection
range includes: CostProfile
range includes: Course
range includes: Credential
range includes: CredentialingAction
range includes: CredentialOrganization
range includes: CredentialType
range includes: Degree
range includes: DigitalBadge
range includes: Diploma
range includes: DoctoralDegree
range includes: GeneralEducationDevelopment
range includes: GeneralEducationLevel1Certificate
range includes: GeneralEducationLevel2Certificate
range includes: HigherEducationLevel1Certificate
range includes: HigherEducationLevel2Certificate
range includes: JourneymanCertificate
range includes: LearningOpportunityProfile
range includes: LearningProgram
range includes: License
range includes: MasterCertificate
range includes: MasterDegree
range includes: MasterOfArtsDegree
range includes: MasterOfScienceDegree
range includes: MicroCredential
range includes: OfferAction
range includes: OpenBadge
range includes: Organization
range includes: PostBaccalaureateCertificate
range includes: PostMasterCertificate
range includes: PreApprenticeshipCertificate
range includes: PriorLearningPolicy
range includes: ProfessionalCertificate
range includes: ProfessionalDoctorate
range includes: ProficiencyCertificate
range includes: QACredentialOrganization
range includes: QualityAssuranceCredential
range includes: RecognizeAction
range includes: RegistrationAction
range includes: RegulateAction
range includes: RenewAction
range includes: ResearchDoctorate
range includes: RevokeAction
range includes: RightsAction
range includes: SecondaryEducationCertificate
range includes: SecondarySchoolDiploma
range includes: SpecialistDegree
range includes: SupportService
range includes: TechnicalLevel1Certificate
range includes: TechnicalLevel2Certificate
range includes: TechnicalLevel3Certificate
range includes: TransferAgreement
range includes: TransferValueProfile
range includes: WorkBasedLearningCertificate