Renewed In
type: Property
comment: Region or political jurisdiction such as a state, province or locale in which the credential is renewable.
term status: stable
change history: https://credreg.net/ctdl/termhistory/ceterms/renewedIn/json
domain includes: AcademicCertificate
domain includes: ApprenticeshipCertificate
domain includes: AssociateDegree
domain includes: AssociateOfAppliedArtsDegree
domain includes: AssociateOfAppliedScienceDegree
domain includes: AssociateOfArtsDegree
domain includes: AssociateOfScienceDegree
domain includes: BachelorDegree
domain includes: BachelorOfArtsDegree
domain includes: BachelorOfScienceDegree
domain includes: Badge
domain includes: BasicTechnicalCertificate
domain includes: Certificate
domain includes: CertificateOfCompletion
domain includes: CertificateOfParticipation
domain includes: Certification
domain includes: Credential
domain includes: Degree
domain includes: DigitalBadge
domain includes: Diploma
domain includes: DoctoralDegree
domain includes: GeneralEducationDevelopment
domain includes: GeneralEducationLevel1Certificate
domain includes: GeneralEducationLevel2Certificate
domain includes: HigherEducationLevel1Certificate
domain includes: HigherEducationLevel2Certificate
domain includes: JourneymanCertificate
domain includes: License
domain includes: MasterCertificate
domain includes: MasterDegree
domain includes: MasterOfArtsDegree
domain includes: MasterOfScienceDegree
domain includes: MicroCredential
domain includes: OpenBadge
domain includes: PostBaccalaureateCertificate
domain includes: PostMasterCertificate
domain includes: PreApprenticeshipCertificate
domain includes: ProfessionalCertificate
domain includes: ProfessionalDoctorate
domain includes: ProficiencyCertificate
domain includes: QualityAssuranceCredential
domain includes: ResearchDoctorate
domain includes: SecondaryEducationCertificate
domain includes: SecondarySchoolDiploma
domain includes: SpecialistDegree
domain includes: TechnicalLevel1Certificate
domain includes: TechnicalLevel2Certificate
domain includes: TechnicalLevel3Certificate
domain includes: WorkBasedLearningCertificate
range includes: JurisdictionProfile