Required Constraints
type: Property
comment: Number of hasConstraint objects that must be fulfilled in order to satisfy the ComponentCondition.
term status: unstable
change history: https://credreg.net/ctdl/termhistory/ceterms/requiredConstraints/json
domain includes: ComponentCondition
range includes: integer