Residency Type
type: Property
comment: Type of legal residency status of a person; select from an existing enumeration of such types.
description: Residency defines the duration of stay required by national, state, provincial or local laws that entitles a person to the legal protection and benefits provided to the applicable type.
usage note: Best practice for U.S. credentials and for submission to the Credential Engine Registry, is to use concepts from the ceterms:Residency vocabulary.
term status: stable
change history: https://credreg.net/ctdl/termhistory/ceterms/residencyType/json
sub property of: credentialAlignment
domain includes: CostProfile
range includes: CredentialAlignmentObject
target scheme: Residency