Right Action
type: Property
comment: Action performed on the right source; select from an existing enumeration of such types.
term status: unstable
change history: https://credreg.net/ctdl/termhistory/ceterms/rightAction/json
domain includes: Constraint
range includes: Concept
target scheme: ArrayOperationCategory