Same As
type: Property
comment: Another entity that unambiguously indicates the identity of the entity being described.
description: Entities that may indicate identity include, but are not limited to, descriptions of entities in open databases such as DBpedia and Wikidata or social media accounts such as FaceBook and LinkedIn.
term status: stable
change history: https://credreg.net/ctdl/termhistory/ceterms/sameAs/json
domain includes: CredentialOrganization
domain includes: CredentialPerson
domain includes: QACredentialOrganization
range includes: anyURI