Scoring Method Description
type: Property
comment: Textual description of the method used to score the assessment.
term status: stable
change history: https://credreg.net/ctdl/termhistory/ceterms/scoringMethodDescription/json
domain includes: AssessmentProfile
domain includes: ProcessProfile
range includes: langString