Sending Department
type: Property
comment: Department (or other subdivision of an organization) from which students transfer under the provisions of an agreement.
term status: unstable
change history: https://credreg.net/ctdl/termhistory/ceterms/sendingDepartment/json
domain includes: TransferAgreement
range includes: CredentialOrganization
range includes: Organization