Service Type
type: Property
comment: Type of service offered by the agent being described; select from an existing enumeration of such terms.
usage note: Recommended best practice for credentials in the Credential Engine Registry is to use concepts from the ceterms:AgentServiceType vocabulary.
term status: stable
change history: https://credreg.net/ctdl/termhistory/ceterms/serviceType/json
domain includes: CredentialOrganization
domain includes: CredentialPerson
domain includes: QACredentialOrganization
range includes: CredentialAlignmentObject
target scheme: AgentServiceType