Skill Embodied
type: Property
comment: Ability to apply knowledge and use know-how to complete tasks and solve problems including types or categories of developed proficiency or dexterity in mental operations and physical processes is embodied either directly or indirectly in this resource.
usage note: The skillEmbodied property may reference a defined skill in an ontology such as O*NET or an existing competency defined in a competency framework.
term status: stable
change history: https://credreg.net/ctdl/termhistory/ceasn/skillEmbodied/json
domain includes: Competency
domain includes: Job
domain includes: Occupation
domain includes: Task
domain includes: WorkRole
range includes: Competency
equivalent property: skillEmbodied