Social Media
type: Property
comment: Social media access point for an agent or an agent's contact point.
term status: stable
change history: https://credreg.net/ctdl/termhistory/ceterms/socialMedia/json
domain includes: ContactPoint
domain includes: CredentialOrganization
domain includes: Organization
domain includes: QACredentialOrganization
range includes: anyURI