Source URL
type: Property
comment: Authoritative source of an entity's information.
description: Citation or description of an authoritative source from which information or description has been derived.
term status: stable
change history: https://credreg.net/ctdl/termhistory/ceterms/source/json
domain includes: EarningsProfile
domain includes: EmploymentOutcomeProfile
domain includes: HoldersProfile
range includes: anyURI