Start Date
type: Property
comment: Date the validity or usefulness of the information in this resource begins.
term status: stable
change history: https://credreg.net/ctdl/termhistory/ceterms/startDate/json
sub property of: temporalCoverage
domain includes: AccreditAction
domain includes: AdvancedStandingAction
domain includes: ApproveAction
domain includes: CostManifest
domain includes: CostProfile
domain includes: CredentialingAction
domain includes: OfferAction
domain includes: RecognizeAction
domain includes: RegulateAction
domain includes: RenewAction
domain includes: RevokeAction
domain includes: RightsAction
range includes: date
equivalent property: startDate