Superseded By
type: Property
comment: Resource that replaces this resource.
description: For example, a credential that outright replaces the credential being described, and is not simply a newer version of the same credential (the two credentials have different CTIDs).
term status: stable
change history: https://credreg.net/ctdl/termhistory/ceterms/supersededBy/json
domain includes: ApprenticeshipCertificate
domain includes: AssociateDegree
domain includes: BachelorDegree
domain includes: Badge
domain includes: Certificate
domain includes: CertificateOfCompletion
domain includes: Certification
domain includes: Credential
domain includes: Degree
domain includes: DigitalBadge
domain includes: Diploma
domain includes: DoctoralDegree
domain includes: GeneralEducationDevelopment
domain includes: JourneymanCertificate
domain includes: License
domain includes: MasterCertificate
domain includes: MasterDegree
domain includes: MicroCredential
domain includes: OpenBadge
domain includes: ProfessionalDoctorate
domain includes: QualityAssuranceCredential
domain includes: ResearchDoctorate
domain includes: SecondarySchoolDiploma
range includes: ApprenticeshipCertificate
range includes: AssociateDegree
range includes: BachelorDegree
range includes: Badge
range includes: Certificate
range includes: CertificateOfCompletion
range includes: Certification
range includes: Credential
range includes: Degree
range includes: DigitalBadge
range includes: Diploma
range includes: DoctoralDegree
range includes: GeneralEducationDevelopment
range includes: JourneymanCertificate
range includes: License
range includes: MasterCertificate
range includes: MasterDegree
range includes: MicroCredential
range includes: OpenBadge
range includes: ProfessionalDoctorate
range includes: QualityAssuranceCredential
range includes: ResearchDoctorate
range includes: SecondarySchoolDiploma