Supersedes
type: Property
comment: Resource that this resource replaces.
description: For example, the credential that is outright replaced by the credential being described, and is not simply an older version of the same credential (the two credentials have different CTIDs).
term status: stable
change history: https://credreg.net/ctdl/termhistory/ceterms/supersedes/json
domain includes: AcademicCertificate
domain includes: AlignmentMap
domain includes: ApprenticeshipCertificate
domain includes: AssessmentProfile
domain includes: AssociateDegree
domain includes: AssociateOfAppliedArtsDegree
domain includes: AssociateOfAppliedScienceDegree
domain includes: AssociateOfArtsDegree
domain includes: AssociateOfScienceDegree
domain includes: BachelorDegree
domain includes: BachelorOfArtsDegree
domain includes: BachelorOfScienceDegree
domain includes: Badge
domain includes: BasicTechnicalCertificate
domain includes: Certificate
domain includes: CertificateOfCompletion
domain includes: CertificateOfParticipation
domain includes: Certification
domain includes: Course
domain includes: Credential
domain includes: CredentialOrganization
domain includes: CredentialType
domain includes: Degree
domain includes: DigitalBadge
domain includes: Diploma
domain includes: DoctoralDegree
domain includes: GeneralEducationDevelopment
domain includes: GeneralEducationLevel1Certificate
domain includes: GeneralEducationLevel2Certificate
domain includes: HigherEducationLevel1Certificate
domain includes: HigherEducationLevel2Certificate
domain includes: JourneymanCertificate
domain includes: LearningOpportunityProfile
domain includes: LearningProgram
domain includes: License
domain includes: MasterCertificate
domain includes: MasterDegree
domain includes: MasterOfArtsDegree
domain includes: MasterOfScienceDegree
domain includes: MicroCredential
domain includes: OpenBadge
domain includes: Organization
domain includes: PostBaccalaureateCertificate
domain includes: PostMasterCertificate
domain includes: PreApprenticeshipCertificate
domain includes: ProfessionalCertificate
domain includes: ProfessionalDoctorate
domain includes: ProficiencyCertificate
domain includes: QACredentialOrganization
domain includes: QualificationsFramework
domain includes: QualityAssuranceCredential
domain includes: ResearchDoctorate
domain includes: SecondaryEducationCertificate
domain includes: SecondarySchoolDiploma
domain includes: SpecialistDegree
domain includes: TechnicalLevel1Certificate
domain includes: TechnicalLevel2Certificate
domain includes: TechnicalLevel3Certificate
domain includes: TransferValueProfile
domain includes: WorkBasedLearningCertificate
range includes: AcademicCertificate
range includes: AlignmentMap
range includes: ApprenticeshipCertificate
range includes: AssessmentProfile
range includes: AssociateDegree
range includes: AssociateOfAppliedArtsDegree
range includes: AssociateOfAppliedScienceDegree
range includes: AssociateOfArtsDegree
range includes: AssociateOfScienceDegree
range includes: BachelorDegree
range includes: BachelorOfArtsDegree
range includes: BachelorOfScienceDegree
range includes: Badge
range includes: BasicTechnicalCertificate