Support Service Type
type: Property
comment: Types of support services offered by an agent; select from an existing enumeration of such types.
term status: unstable
change history: https://credreg.net/ctdl/termhistory/ceterms/supportServiceType/json
domain includes: SupportService
range includes: CredentialAlignmentObject
target scheme: SupportServiceCategory