Target Assessment
type: Property
comment: Assessment that provides direct, indirect, formative or summative evaluation or estimation of the nature, ability, or quality for an entity.
term status: stable
change history: https://credreg.net/ctdl/termhistory/ceterms/targetAssessment/json
domain includes: AssessmentProfile
domain includes: ConditionProfile
domain includes: LearningOpportunityProfile
domain includes: ProcessProfile
range includes: Assessment
range includes: AssessmentProfile