Target Competency
type: Property
comment: A competency relevant to the condition being described.
term status: stable
change history: https://credreg.net/ctdl/termhistory/ceterms/targetCompetency/json
sub property of: credentialAlignment
domain includes: ConditionProfile
range includes: Competency
range includes: CredentialAlignmentObject