Target Competency Framework
type: Property
comment: Competency framework relevant to the process being described.
term status: stable
change history: https://credreg.net/ctdl/termhistory/ceterms/targetCompetencyFramework/json
sub property of: credentialAlignment
domain includes: ProcessProfile
range includes: CompetencyFramework
range includes: CredentialAlignmentObject